Merge support for resize in TCPRetransmitter

12 jobs from flowclick in 11 minutes and 26 seconds (queued for 1 second)
Status Job ID Name Coverage
  Test
failed #11202
autobatch

00:52

failed #11201
batch

01:19

failed #11205
dpdk-batch

00:53

failed #11206
dpdk-nobatch

01:52

failed #11211
fbatch

00:32

failed #11212
fnetmap

00:29

failed #11203
ip6

00:50

failed #11204
mt

00:52

failed #11208
netmap

00:50

failed #11209
netmap_nopool

00:52

failed #11210
netmap_nopool_nozc

01:07

failed #11207
netmap_single

00:51

 
Name Stage Failure
failed
fnetmap Test There is an unknown failure, please try again
../lib/flownode.cc:638:47: erreur: expected string-literal before ‘)’ token
../lib/flownode.cc:639:46: erreur: expected ‘,’ before ‘)’ token
static_assert(step() < capacity() / 2);
^
../lib/flownode.cc:639:46: erreur: expected string-literal before ‘)’ token
make[1]: *** [flownode.o] Erreur 1
make[1] : on quitte le répertoire « /home/gitlab-runner/builds/7dadf78c/0/sdn-pp/fastclick/userlevel »
make: *** [userlevel] Erreur 2
ERROR: Job failed: exit status 1
failed
fbatch Test There is an unknown failure, please try again
../lib/flownode.cc:638:47: erreur: expected string-literal before ‘)’ token
../lib/flownode.cc:639:46: erreur: expected ‘,’ before ‘)’ token
static_assert(step() < capacity() / 2);
^
../lib/flownode.cc:639:46: erreur: expected string-literal before ‘)’ token
make[1]: *** [flownode.o] Erreur 1
make[1] : on quitte le répertoire « /home/gitlab-runner/builds/c853de22/0/sdn-pp/fastclick/userlevel »
make: *** [userlevel] Erreur 2
ERROR: Job failed: exit status 1
failed
netmap_nopool_nozc Test There is an unknown failure, please try again
                 from ../elements/ids/groupregexclassifier.cc:2:
../elements/ids/regexset.hh:6:21: erreur fatale: re2/re2.h : Aucun fichier ou dossier de ce type
#include <re2/re2.h>
^
compilation terminée.
make[1]: *** [groupregexclassifier.o] Erreur 1
make[1] : on quitte le répertoire « /home/gitlab-runner/builds/7dadf78c/0/sdn-pp/fastclick/userlevel »
make: *** [userlevel] Erreur 2
ERROR: Job failed: exit status 2
failed
netmap_nopool Test There is an unknown failure, please try again
                 from ../elements/ids/groupregexclassifier.cc:2:
../elements/ids/regexset.hh:6:21: erreur fatale: re2/re2.h : Aucun fichier ou dossier de ce type
#include <re2/re2.h>
^
compilation terminée.
make[1]: *** [groupregexclassifier.o] Erreur 1
make[1] : on quitte le répertoire « /home/gitlab-runner/builds/c853de22/0/sdn-pp/fastclick/userlevel »
make: *** [userlevel] Erreur 2
ERROR: Job failed: exit status 2
failed
netmap Test There is an unknown failure, please try again
                 from ../elements/ids/groupregexclassifier.cc:2:
../elements/ids/regexset.hh:6:21: erreur fatale: re2/re2.h : Aucun fichier ou dossier de ce type
#include <re2/re2.h>
^
compilation terminée.
make[1]: *** [groupregexclassifier.o] Erreur 1
make[1] : on quitte le répertoire « /home/gitlab-runner/builds/7dadf78c/0/sdn-pp/fastclick/userlevel »
make: *** [userlevel] Erreur 2
ERROR: Job failed: exit status 1
failed
netmap_single Test There is an unknown failure, please try again
                 from ../elements/ids/groupregexclassifier.cc:2:
../elements/ids/regexset.hh:6:21: erreur fatale: re2/re2.h : Aucun fichier ou dossier de ce type
#include <re2/re2.h>
^
compilation terminée.
make[1]: *** [groupregexclassifier.o] Erreur 1
make[1] : on quitte le répertoire « /home/gitlab-runner/builds/c853de22/0/sdn-pp/fastclick/userlevel »
make: *** [userlevel] Erreur 2
ERROR: Job failed: exit status 1
failed
dpdk-batch Test There is an unknown failure, please try again
                 from ../elements/ids/groupregexclassifier.cc:2:
../elements/ids/regexset.hh:6:21: erreur fatale: re2/re2.h : Aucun fichier ou dossier de ce type
#include <re2/re2.h>
^
compilation terminée.
make[1]: *** [groupregexclassifier.o] Erreur 1
make[1] : on quitte le répertoire « /home/gitlab-runner/builds/7dadf78c/0/sdn-pp/fastclick/userlevel »
make: *** [userlevel] Erreur 2
ERROR: Job failed: exit status 1
failed
mt Test There is an unknown failure, please try again
                 from ../elements/ids/groupregexclassifier.cc:2:
../elements/ids/regexset.hh:6:21: erreur fatale: re2/re2.h : Aucun fichier ou dossier de ce type
#include <re2/re2.h>
^
compilation terminée.
make[1]: *** [groupregexclassifier.o] Erreur 1
make[1] : on quitte le répertoire « /home/gitlab-runner/builds/c853de22/0/sdn-pp/fastclick/userlevel »
make: *** [userlevel] Erreur 2
ERROR: Job failed: exit status 2
failed
ip6 Test There is an unknown failure, please try again
                 from ../elements/ids/groupregexclassifier.cc:2:
../elements/ids/regexset.hh:6:21: erreur fatale: re2/re2.h : Aucun fichier ou dossier de ce type
#include <re2/re2.h>
^
compilation terminée.
make[1]: *** [groupregexclassifier.o] Erreur 1
make[1] : on quitte le répertoire « /home/gitlab-runner/builds/7dadf78c/0/sdn-pp/fastclick/userlevel »
make: *** [userlevel] Erreur 2
ERROR: Job failed: exit status 2
failed
autobatch Test There is an unknown failure, please try again
                 from ../elements/ids/groupregexclassifier.cc:2:
../elements/ids/regexset.hh:6:21: erreur fatale: re2/re2.h : Aucun fichier ou dossier de ce type
#include <re2/re2.h>
^
compilation terminée.
make[1]: *** [groupregexclassifier.o] Erreur 1
make[1] : on quitte le répertoire « /home/gitlab-runner/builds/c853de22/0/sdn-pp/fastclick/userlevel »
make: *** [userlevel] Erreur 2
ERROR: Job failed: exit status 2
failed
batch Test There is an unknown failure, please try again
                 from ../elements/ids/groupregexclassifier.cc:2:
../elements/ids/regexset.hh:6:21: erreur fatale: re2/re2.h : Aucun fichier ou dossier de ce type
#include <re2/re2.h>
^
compilation terminée.
make[1]: *** [groupregexclassifier.o] Erreur 1
make[1] : on quitte le répertoire « /home/gitlab-runner/builds/7dadf78c/0/sdn-pp/fastclick/userlevel »
make: *** [userlevel] Erreur 2
ERROR: Job failed: exit status 2
failed
dpdk-nobatch Test There is an unknown failure, please try again
                 from ../elements/ids/groupregexclassifier.cc:2:
../elements/ids/regexset.hh:6:21: erreur fatale: re2/re2.h : Aucun fichier ou dossier de ce type
#include <re2/re2.h>
^
compilation terminée.
make[1]: *** [groupregexclassifier.o] Erreur 1
make[1] : on quitte le répertoire « /home/gitlab-runner/builds/c853de22/0/sdn-pp/fastclick/userlevel »
make: *** [userlevel] Erreur 2
ERROR: Job failed: exit status 1